idcode,practice,age,sex,random,hba1c0,hba1c1,hba1c2,hbac3y,nsmok0,nsmok4,nsmok8,nsmok12,smoken3y
102004,2,49,Male,Control,12,8,,,1,1,,1,0
103022,3,52,Male,Intervention,7,6.3000002,,,,,,,0
105017,5,59,Male,Intervention,,7,6,6.4,1,1,1,1,
105019,5,55,Male,Intervention,9.3000002,6.4000001,6.4000001,6.2,,,,,0
106008,6,62,Female,Control,7.1999998,6.0999999,5.9000001,,1,1,1,,0
106012,6,79,Male,Control,6.3000002,6.0999999,6,,1,1,1,1,0
109003,9,59,Male,Control,7.9000001,6.5999999,6.5999999,6.9,1,1,1,1,0
109005,9,65,Male,Control,6.9000001,6.1999998,5.6999998,6.2,1,1,1,1,0
109010,9,61,Male,Control,11.5,6.1999998,5.9000001,7.9,1,1,1,1,0
109011,9,57,Male,Control,6.5999999,5.5999999,5.5999999,5.9,1,1,1,1,0
109013,9,72,Male,Control,10.8,6.9000001,6.5999999,5.5,1,1,1,1,0
110016,10,39,Male,Intervention,11.4,7.6999998,6.1999998,7.1,1,1,1,1,0
112001,12,53,Female,Control,6.5,6,6.0999999,7.1,1,1,1,1,0
112002,12,61,Female,Control,10.2,7.0999999,6.6999998,7.4,1,1,,1,0
112007,12,58,Female,Control,8.8999996,7.3000002,6.9000001,,0,0,0,0,0
112009,12,56,Female,Control,9.3999996,7.6999998,7.4000001,6.3,1,0,0,0,
501003,1,42,Female,Intervention,7.1999998,6.5,5.8000002,6.6,0,0,0,0,15
501014,1,45,Male,Intervention,5.4000001,5.3000002,,6,1,,1,1,
501020,1,46,Female,Intervention,8.8000002,6.9000001,6.9000001,5.9,1,1,1,1,0
501022,1,37,Female,Intervention,8.8000002,7.3000002,6.4000001,5.5,1,1,1,1,0
501028,1,43,Male,Intervention,10,8.8000002,7.6999998,7.5,0,1,0,1,
501029,1,34,Male,Intervention,11.7,9.6000004,8.1000004,8.4,1,1,1,,
501042,1,77,Male,Intervention,9.3999996,7.8000002,7.6999998,6.4,1,1,1,1,0
501053,1,68,Male,Intervention,6.9000001,,7.0999999,9.5,1,1,1,1,0
501073,1,51,Male,Intervention,10.5,6.4000001,7.5999999,6.2,0,0,1,0,-99
501081,1,82,Male,Intervention,11.2,7.4000001,7.0999999,5.8,1,1,1,1,0
502007,2,59,Female,Intervention,6.3000002,6.4000001,6.5,6.1,1,1,1,1,0
502016,2,69,Male,Intervention,7.6999998,7.1999998,6.5,7.1,1,1,1,1,0
502033,2,47,Female,Intervention,7.0999999,6.5999999,6.4000001,6.3,1,1,1,1,0
502039,2,51,Male,Intervention,6.1999998,6,6,7.5,1,1,1,1,0
502077,2,52,Male,Intervention,7.6999998,6.8000002,7,7.9,1,,1,1,0
503001,3,62,Male,Intervention,8.5,7.9000001,7.4000001,7.3,1,1,1,1,0
503008,3,55,Male,Intervention,6.8000002,7,7.0999999,7.8,0,0,0,0,20
503038,3,69,Female,Intervention,7.8000002,6.6999998,6.5,7.2,1,1,1,1,0
503045,3,61,Male,Intervention,7.5999999,6.6999998,6.3000002,6.5,0,0,0,0,0
503063,3,55,Male,Intervention,7.5,6.5999999,7.1999998,7.3,0,0,1,0,14
503066,3,57,Male,Intervention,7.5,6.1999998,6.5999999,5.8,1,1,,1,
503067,3,61,Female,Intervention,9.8000002,7.1999998,6.4000001,6.4,1,1,1,1,0
504044,4,76,Female,Control,7,6.1999998,6.0999999,5.9,1,1,1,1,0
504048,4,69,Female,Control,8,6.8000002,6.1999998,7.1,1,1,1,,0
504050,4,77,Female,Control,6,5.9000001,5.5,5.8,1,1,1,1,0
504059,4,74,Male,Control,6.4000001,6.5999999,,6,0,0,0,0,8
504065,4,54,Male,Control,7.1999998,6.4000001,6.1999998,6.8,1,1,1,1,0
504071,4,70,Male,Control,7.0999999,6,5.6999998,6.2,1,1,1,1,0
504082,4,67,Female,Control,5.4000001,5.5999999,5.5999999,5.3,1,1,,,0
504084,4,51,Female,Control,8.1999998,6.4000001,6.1999998,7,1,1,1,1,0
504085,4,62,Male,Control,6.1999998,,6.4000001,6.6,1,1,,,0
504088,4,67,Male,Control,7,6.8000002,6.4000001,5.8,1,1,1,1,0
504089,4,49,Male,Control,7.9000001,6.6999998,6.5,6.3,1,1,0,0,3
506004,6,69,Female,Intervention,5.6999998,5.8000002,5.9000001,5.8,1,1,1,1,0
506006,6,50,Male,Intervention,6.3000002,7.0999999,7.4000001,8.6,0,0,,0,
506049,6,51,Male,Intervention,5.6999998,5.9000001,6.3000002,6.2,1,1,1,1,0
507011,7,61,Male,Intervention,6.3000002,6.8000002,6.4000001,6.5,1,,1,1,0
507012,7,70,Female,Intervention,12.7,7.5,6.8000002,8.3,1,1,1,1,0
507017,7,57,Female,Intervention,11.5,7.9000001,7.1999998,6.4,1,,1,1,0
507018,7,49,Female,Intervention,6.4000001,6,5.8000002,6,1,1,1,1,0
507026,7,65,Male,Intervention,5.9000001,5.5,5.5999999,,1,1,1,1,0
507034,7,65,Male,Intervention,6.8000002,6.6999998,6.5,6.6,1,1,1,,0
507036,7,56,Male,Intervention,8.3999996,5.5,5.5999999,6.1,1,1,1,1,-99
507037,7,58,Female,Intervention,10.7,8.3000002,6.8000002,7,1,1,1,1,0
507052,7,55,Female,Intervention,8.8000002,6.9000001,5.8000002,6.1,0,0,1,1,
507055,7,54,Male,Intervention,9.1999998,5.8000002,5.5,5.7,1,1,1,1,0
507056,7,75,Female,Intervention,7.0999999,6.5,6.6999998,,1,1,1,1,0
507057,7,62,Male,Intervention,13.4,6.5999999,7.5999999,7,1,1,1,1,0
507062,7,82,Female,Intervention,8.1000004,7.1999998,7.5,6.5,1,1,1,1,0
507070,7,47,Female,Intervention,7.1999998,6.1999998,5.9000001,6.5,1,1,1,1,
507072,7,63,Male,Intervention,8,9.6000004,6.8000002,6.4,1,,1,1,0
507075,7,72,Female,Intervention,11.6,8.6999998,7,7.5,1,1,1,1,0
507079,7,61,Female,Intervention,8.1999998,7.0999999,6.5999999,6.6,1,1,1,1,0
507080,7,63,Female,Intervention,9.6999998,6.5,6.5,7.4,,1,1,1,0
508041,8,43,Male,Control,5.4000001,6,6,6.9,1,1,1,1,-99
508069,8,57,Male,Control,5.5,5.5999999,6,6.4,1,,,,
601022,1,70,Female,Control,7.5,6.5,6.3000002,6.9,1,1,1,1,0
601027,1,77,Female,Control,6.9000001,6.6999998,6.5,6.4,,,,,0
601030,1,61,Male,Control,6.9000001,6.5999999,6.5999999,6.3,0,0,0,0,20
601038,1,45,Male,Control,6.5999999,6.5999999,6.5999999,7.2,1,1,1,1,0
601039,1,76,Male,Control,7.1999998,7,7,6.5,1,1,1,,0
601040,1,65,Female,Control,5.5999999,5.8000002,5.9000001,5.8,1,1,1,1,0
601048,1,59,Female,Control,6.4000001,6.8000002,6.4000001,6,1,,1,,
601051,1,71,Male,Control,6.1999998,6.1999998,6.1999998,5.7,,,,,
601055,1,67,Male,Control,10.8,8,7.4000001,6.9,1,1,1,,0
601056,1,48,Male,Control,10.8,9.5,5.9000001,6.9,1,1,1,,-99
601060,1,79,Male,Control,6.5,6.5,6.6999998,6.4,1,1,,,0
601064,1,70,Male,Control,7.5999999,7.4000001,6.8000002,5.7,1,1,1,1,0
602003,2,73,Female,Control,8.3999996,6.5999999,,6.9,1,1,1,1,
602017,2,48,Male,Control,7.0999999,7.1999998,6.5999999,7.4,1,1,1,,
602026,2,36,Male,Control,11.3,12,9.6000004,7.5,,,,,0
602029,2,76,Female,Control,6.5999999,6.0999999,6.3000002,6.2,1,1,1,1,0
602037,2,64,Female,Control,6.5,,6.0999999,5.9,1,1,1,1,0
604042,4,56,Male,Intervention,6,6,,6.1,1,1,1,1,0
604043,4,60,Female,Intervention,13.9,,6.9000001,6.4,1,,,,0
604062,4,73,Female,Intervention,9.8999996,7.8000002,,6.6,1,,1,,0
604069,4,72,Male,Intervention,8,6.9000001,,7.3,,,,,0
604070,4,63,Female,Intervention,7.1999998,8,,7.4,1,,,,
604074,4,75,Female,Intervention,12.3,8.6999998,7.1999998,8.1,1,1,1,1,0
605006,5,57,Female,Control,12.8,10.5,7.8000002,8,1,1,1,1,0
605007,5,76,Female,Control,6.8000002,6.4000001,6.4000001,6.4,1,1,,,
605008,5,69,Male,Control,10.7,9.1999998,6.6999998,7.1,,,,,0
605016,5,64,Male,Control,7.8000002,7.5,7.6999998,7.3,1,,1,1,0
605019,5,79,Female,Control,7.5,6.8000002,6.6999998,7.1,1,1,1,1,0
605041,5,82,Male,Control,10.8,8.5,8.3999996,7.6,1,1,1,1,0
605044,5,43,Male,Control,11.2,10.3,6.6999998,6.6,1,,1,,0
605047,5,77,Female,Control,6.5,6.5,6.6999998,6.8,1,1,1,1,0
605057,5,61,Male,Control,7.3000002,7.1999998,7.3000002,7.3,1,1,1,,0
605058,5,64,Male,Control,5.9000001,5.9000001,5.5,6.2,1,1,1,1,0
605065,5,80,Female,Control,6.5,5.8000002,6,5.7,1,1,1,1,
606014,6,54,Male,Intervention,11.9,7.5999999,7.4000001,7.5,1,1,1,1,0
607002,7,44,Male,Control,7.3000002,7.1999998,,7.3,1,1,,1,0
607005,7,47,Female,Control,12,7,7.5,8,1,1,,,0
607023,7,34,Male,Control,12.2,9.8999996,8.6999998,6.8,0,0,0,0,12
607067,7,37,Male,Control,12.3,7.5,6.9000001,9.9,1,1,1,,0
608004,8,66,Male,Intervention,9.3000002,7.0999999,7.0999999,6.1,1,1,1,1,0
608015,8,37,Female,Intervention,7.3000002,6.5999999,6.9000001,,1,1,1,1,0
608031,8,66,Female,Intervention,7,7,7.5,7.4,1,1,1,1,-99
608078,8,66,Male,Intervention,8.1000004,6.0999999,6.0999999,6.2,1,1,,1,0
608080,8,58,Male,Intervention,10,9.1000004,9.3000002,6.8,0,1,1,,0
610021,10,69,Male,Control,8.8000002,6.5,,6.2,1,1,1,1,0
610025,10,79,Female,Control,,5.6999998,,6,1,1,1,1,0
612059,12,71,Male,Intervention,7.6999998,7.0999999,6.9000001,6.8,1,1,1,1,0
612066,12,46,Male,Intervention,10.8,7.4000001,,6.9,,,,,0
612081,12,49,Female,Intervention,7.1999998,6.1999998,6.4000001,8.4,1,1,1,1,-99
612082,12,44,Male,Intervention,7.1999998,6.5,6.8000002,6.8,0,,1,,
613028,13,65,Male,Intervention,,4.8000002,5.5,5.4,0,1,1,1,0
613061,13,58,Male,Intervention,10,8,9.1000004,7.5,1,1,1,1,0
701001,1,41,Female,Intervention,7.0999999,6.8000002,7.4000001,7,1,1,1,1,0
701003,1,78,Female,Intervention,11.8,7.1999998,6.6999998,8.2,0,0,0,0,10
701005,1,64,Male,Intervention,6.9000001,6.8000002,6.8000002,6.7,1,1,1,,0
701006,1,74,Female,Intervention,6,6.1999998,5.8000002,6.3,1,1,1,,
701009,1,56,Female,Intervention,11.7,9.6000004,8.8999996,6.6,0,1,,0,
701037,1,69,Female,Intervention,12.2,7.0999999,6.4000001,6.5,1,1,1,,0
701047,1,69,Female,Intervention,9.8999996,5.5999999,5.8000002,6.1,1,,1,1,0
701048,1,73,Male,Intervention,8.8999996,7,6.5,7.1,1,1,1,1,0
701058,1,50,Male,Intervention,7.1999998,9.1000004,6.8000002,6,1,,,,
701062,1,72,Male,Intervention,7.1999998,6.8000002,6.8000002,8.1,,,,,0
701070,1,54,Male,Intervention,9.3999996,7.8000002,5.6999998,6,0,0,0,,10
702002,2,69,Female,Intervention,6.4000001,6.5,6.5,6.5,1,,1,1,0
702012,2,57,Female,Intervention,6.6999998,6.3000002,,6.5,0,0,0,1,20
702016,2,76,Female,Intervention,10.3,8.3999996,7,7,1,1,1,1,0
702024,2,53,Male,Intervention,10.5,6.4000001,6,6.4,1,1,1,1,0
702044,2,33,Female,Intervention,6.4000001,6.5,,7,1,1,1,1,0
702059,2,53,Male,Intervention,12.3,,9.6999998,6.6,1,1,1,1,
702060,2,67,Female,Intervention,10.4,8.3000002,6.9000001,6.9,1,1,1,1,0
703018,3,57,Female,Control,10.4,6.8000002,,11,1,1,1,1,0
703020,3,63,Male,Control,6.6999998,6.0999999,6,5.9,1,1,1,1,0
704026,4,70,Female,Intervention,6.0999999,6.0999999,6.4000001,6.5,1,1,1,1,0
704038,4,69,Male,Intervention,15.4,10.1,8.5,7.9,1,1,1,,0
704052,4,51,Male,Intervention,10.4,7.8000002,7.3000002,8.4,1,1,1,1,0
704068,4,67,Male,Intervention,8.8000002,9.1000004,7,6.7,1,1,1,,0
705004,5,51,Female,Control,9.3000002,10.9,7.1999998,6.3,0,0,0,0,8
705007,5,66,Female,Control,6.3000002,6.3000002,6.1999998,6.2,1,,1,1,0
705015,5,67,Female,Control,11.4,10.8,7.9000001,6.6,1,1,1,1,-99
705032,5,40,Female,Control,7.1999998,6.9000001,7.8000002,7.5,,,,,15
705033,5,46,Female,Control,6.9000001,7.0999999,7.3000002,6.9,0,0,0,0,10
705034,5,66,Male,Control,6.8000002,7.0999999,6.6999998,6.4,1,1,1,1,0
705042,5,55,Female,Control,6.4000001,6.4000001,6.0999999,6,,,,,0
705043,5,61,Male,Control,6.5,6.4000001,6.1999998,6.8,,,,,0
705051,5,72,Male,Control,5.9000001,5.6999998,5.6999998,5.9,,,,,0
705063,5,75,Male,Control,6.5999999,6.0999999,6.1999998,6.5,1,1,1,,
705069,5,59,Male,Control,7.1999998,6.0999999,6.1999998,6.2,,,,,0
801046,1,61,Female,Control,6.5,6.6999998,6.8000002,5.6,1,1,1,1,0
801052,1,60,Male,Control,7.8000002,7.6999998,7.0999999,7.5,1,1,1,1,0
803010,3,53,Male,Intervention,8.6000004,8.1999998,7.3000002,7.9,1,1,1,1,0
805011,5,64,Male,Intervention,7.3000002,6.9000001,6.9000001,7.1,1,1,1,1,0
805027,5,78,Male,Intervention,6.4000001,6.6999998,6.6999998,7.3,1,1,1,1,0
805042,5,51,Male,Intervention,8.3999996,7,,6.4,1,1,1,1,0
805086,5,50,Male,Intervention,5.9000001,6.0999999,6.1999998,6.7,1,1,1,1,0
805092,5,50,Female,Intervention,6,6,5.6999998,5.9,1,1,1,,0
808076,8,28,Male,Intervention,5.6999998,,5.1999998,6,1,1,,,0
811066,11,68,Female,Intervention,6.5,6.1999998,6.4000001,7,0,0,0,0,10
811073,11,52,Male,Intervention,6.5999999,6.4000001,6.4000001,6.6,1,1,1,1,0
811088,11,52,Male,Intervention,16.1,7.6999998,6,6.7,1,1,1,,0
812034,12,60,Male,Intervention,5.6999998,5.9000001,6.0999999,6.7,1,1,1,1,0
812044,12,56,Female,Intervention,6.6999998,6.5,,6.8,1,,,,
812070,12,70,Male,Intervention,6.8000002,6.6999998,6.6999998,6.8,1,1,1,1,0
816051,16,54,Male,Control,12.5,9.1999998,11.2,7.7,1,1,1,1,0
817015,17,55,Male,Control,6,5.5999999,5.6999998,5.7,1,1,1,,0
817020,17,73,Female,Control,7,6.5999999,6.5999999,6.6,1,1,,1,
817062,17,60,Male,Control,9.3000002,7,6.1999998,8.8,1,1,,,0
817103,17,60,Male,Control,12.9,6.0999999,6.1999998,7.6,0,,,0,20
817104,17,72,Female,Control,11.4,7.6999998,6.6999998,6.6,1,,1,1,0
817108,17,61,Male,Control,9.6999998,6.4000001,6.5,7.2,1,1,1,1,0
817109,17,47,Female,Control,6.6999998,6.6999998,6.5999999,6.3,1,1,1,1,0
817115,17,61,Male,Control,6.4000001,6.6999998,6,6,1,1,1,1,0
818006,18,73,Female,Intervention,7.5999999,7.8000002,6.5999999,8,1,1,1,1,0
818012,18,50,Female,Intervention,9.6000004,11.6,11.5,8.1,1,1,1,,0
818021,18,69,Female,Intervention,7.8000002,7.1999998,7.4000001,7.1,1,1,1,1,0
818084,18,61,Female,Intervention,8.3999996,8,6.5999999,6.7,1,1,1,,0
819026,19,63,Female,Intervention,8.8000002,6.5,8,6.5,1,1,1,1,0
819090,19,52,Female,Intervention,10,10,8.5,8.1,1,,,1,0
820031,20,53,Male,Control,5.9000001,5.9000001,6,5.8,1,1,1,1,0
820110,20,72,Male,Control,6.3000002,5.9000001,6,7.1,1,1,1,1,0
823019,23,55,Male,Control,7.0999999,7.5999999,7.1999998,7.4,1,1,1,1,
823050,23,69,Male,Control,6.5,6.5999999,6.5,7,1,1,1,1,0
823078,23,56,Female,Control,7.1999998,6.8000002,6.3000002,7.3,1,1,1,1,0
823080,23,50,Male,Control,7.4000001,7.5,7.0999999,6.9,1,1,1,1,0
823114,23,77,Female,Control,6,6,6.0999999,6.6,1,,1,1,0
823117,23,53,Male,Control,6.1999998,6.1999998,6.5,6.3,1,1,1,1,0
825002,25,71,Female,Control,7.0999999,7.3000002,6.6999998,7.9,1,1,1,1,0
825008,25,68,Male,Control,7.9000001,7.3000002,6.8000002,7.3,,,,,
825017,25,75,Female,Control,,6.4000001,6.1999998,,,,,,0
825039,25,65,Male,Control,7.5999999,7.5,6.8000002,7.2,1,,,,
825054,25,58,Female,Control,7.5999999,6.4000001,6.6999998,6.3,0,0,0,0,20
825089,25,69,Female,Control,9.3000002,7.3000002,6.5999999,9.7,0,0,0,0,0
825100,25,56,Female,Control,11.1,7.4000001,,7.2,1,1,1,1,0
825111,25,29,Female,Control,6.5999999,6.3000002,6.5999999,6.6,0,,0,0,3
825112,25,31,Male,Control,8.1000004,6.5999999,6.6999998,7.4,0,,0,0,
825113,25,70,Male,Control,7,6.5999999,7.0999999,6.2,0,0,0,0,
825116,25,35,Male,Control,7.0999999,5.8000002,5.8000002,6.7,1,1,1,,0
827029,27,52,Female,Intervention,6.8000002,6.6999998,7.1999998,6.2,1,1,1,1,0
827036,27,73,Female,Intervention,6.6999998,7.1999998,7.6999998,6.8,0,1,1,1,0
827057,27,54,Male,Intervention,12.3,5.9000001,6.0999999,5.3,1,1,1,1,0
827068,27,63,Male,Intervention,10.7,6.4000001,6.3000002,6.3,1,1,1,1,0
827075,27,66,Male,Intervention,6.1999998,6.4000001,6.0999999,6.4,1,1,1,1,0
828001,28,71,Female,Intervention,12.3,10.5,9.8000002,10.3,1,1,1,1,0
828003,28,50,Female,Intervention,10.8,8.1999998,7.8000002,,0,0,,0,10
828085,28,55,Male,Intervention,6.5999999,6.6999998,6.6999998,,0,0,,,2
828093,28,52,Male,Intervention,11,6.9000001,10.3,6.1,1,1,1,1,30
830022,30,35,Female,Intervention,8.3000002,7.3000002,7.4000001,7.7,0,1,1,,
830048,30,65,Male,Intervention,7.5999999,6.4000001,6.0999999,5.8,1,1,1,,0
830049,30,46,Female,Intervention,9.6000004,7.3000002,6.8000002,8.2,1,1,1,1,0
830058,30,43,Female,Intervention,10.4,7.5999999,7.5999999,7.9,0,0,0,0,5
830074,30,44,Male,Intervention,7.5999999,6.3000002,6.3000002,8.2,1,1,1,1,0
830077,30,59,Female,Intervention,8.3999996,7.9000001,7,6.9,0,0,0,0,10
830081,30,69,Female,Intervention,5.8000002,5.8000002,5.6999998,5.9,1,1,1,1,0
830082,30,68,Male,Intervention,5.5,5.8000002,5.5,5.9,1,1,,1,0
831005,31,63,Female,Intervention,9.3000002,10.5,7.9000001,5.9,0,0,0,0,0
902004,2,73,Female,Intervention,5.6999998,5.9000001,6.1999998,5.5,1,1,1,,0
902018,2,70,Female,Intervention,6.1999998,6.1999998,5.8000002,6,1,1,1,,0
902027,2,76,Female,Intervention,6.5999999,6.6999998,6.3000002,6.9,1,1,,,0
902033,2,72,Female,Intervention,5.9000001,6.3000002,5.8000002,6.3,1,,,,0
902054,2,54,Male,Intervention,6,5.5999999,5.3000002,5.8,1,,,,0
902058,2,57,Female,Intervention,7,6.6999998,6.1999998,6.5,1,1,,1,0
903006,3,65,Female,Intervention,6.4000001,6.4000001,6.0999999,6.9,1,1,1,,-99
903037,3,44,Male,Intervention,11.6,9.3000002,,10.8,1,,,,0
903084,3,58,Male,Intervention,9.6999998,5.6999998,6.5,5.8,0,,0,,-99
904002,4,65,Male,Intervention,6.9000001,6,5.9000001,5.5,1,1,1,,0
904003,4,56,Female,Intervention,7.6999998,7.4000001,8.3000002,6,1,,,,0
904005,4,45,Male,Intervention,5.6999998,6.4000001,6.6999998,6.8,1,,1,,0
904007,4,53,Male,Intervention,8.6999998,7.1999998,6.5999999,9.3,1,1,1,,
904011,4,42,Female,Intervention,5.9000001,6.3000002,5.8000002,5.7,1,,1,,0
904038,4,46,Male,Intervention,6.5999999,6.3000002,6.0999999,8.9,1,,1,,0
904039,4,68,Female,Intervention,6.5999999,7.3000002,6.9000001,7.5,1,,1,,0
904066,4,58,Female,Intervention,6.5999999,6.4000001,6.6999998,6.6,1,1,,1,0
904081,4,45,Female,Intervention,7.3000002,5.8000002,6,10.8,1,,1,,0
904085,4,50,Male,Intervention,9.8000002,6.5999999,6.9000001,6.8,1,,1,,
905019,5,38,Female,Control,6.0999999,5.9000001,5.8000002,5.7,1,1,,,0
905029,5,78,Male,Control,7,6.5,6.8000002,6.4,1,1,1,,0
905051,5,61,Female,Control,5.8000002,5.6999998,5.5,5.1,,,,,0
905082,5,65,Male,Control,7.3000002,7.1999998,7.4000001,7,1,,1,,0
905087,5,53,Male,Control,10.4,10.4,9.1999998,8.3,,,,,0
908012,8,54,Female,Control,6.3000002,6.0999999,6.0999999,6.6,1,1,1,,0
908044,8,47,Male,Control,13,8.1000004,7.5,8.8,1,1,,,0
908075,8,57,Male,Control,10.1,7.6999998,8,7.8,1,,,,0
909001,9,70,Male,Control,6.4000001,6.5999999,6,6.7,1,1,1,,
909023,9,70,Male,Control,6.0999999,6.0999999,5.8000002,6.1,1,1,,,0
909061,9,57,Male,Control,6.5,6.0999999,6.5,6.4,1,1,,,0
911034,11,60,Male,Control,6.6999998,6.5999999,6.5,6.9,,,,,0
911035,11,70,Male,Control,6.4000001,6.1999998,6.3000002,6.7,1,1,1,1,0
912008,12,58,Female,Intervention,8.3000002,,8.6999998,11,1,1,,,0
912014,12,54,Female,Intervention,6.4000001,6.1999998,6.6999998,8,1,1,1,,0
912024,12,76,Female,Intervention,6.3000002,6.1999998,6.1999998,7.1,1,1,1,,0
912025,12,71,Male,Intervention,5.5999999,5.5999999,5.6999998,6,1,1,1,,0
912045,12,50,Male,Intervention,6.3000002,6.1999998,6.1999998,8,1,,,1,0
912068,12,69,Male,Intervention,5.5,5.5,5.5,5.9,1,,,,0
912086,12,51,Male,Intervention,5.9000001,5.6999998,5.5999999,6.6,1,,1,,0
1001001,1,53,Female,Control,7.6999998,7,7,6.4,1,1,1,1,0
1001012,1,77,Female,Control,6.5,6.5,6.6999998,7.2,1,1,1,1,0
1001013,1,66,Male,Control,5,5,5,5.4,1,1,1,1,
1001014,1,75,Female,Control,6,5.9000001,6,6.6,1,,1,1,0
1001023,1,29,Female,Control,5.4000001,,,5.7,1,,1,,
1001025,1,81,Male,Control,5.8000002,6.0999999,6.0999999,5.7,1,1,1,,
1001027,1,65,Male,Control,5.5999999,5.4000001,5.5999999,6.2,1,1,1,1,-99
1001037,1,62,Male,Control,8.5,6,5.5999999,8.4,,,,,0
1001054,1,56,Female,Control,5.4000001,5.5999999,5.5,5.9,0,0,0,0,7
1001058,1,61,Male,Control,6.1999998,6.3000002,6.5999999,7.7,1,,,,
1001066,1,66,Female,Control,5.8000002,5.6999998,5.8000002,6.9,1,1,1,1,0
1001077,1,65,Male,Control,6.8000002,7,7.6999998,7,1,,1,1,
1001079,1,82,Male,Control,7.1999998,6.6999998,6.3000002,6.9,1,1,1,1,0
1003004,3,58,Female,Intervention,10.8,8.5,7.5999999,7.2,1,,1,,-99
1003005,3,62,Male,Intervention,9.6000004,5.6999998,6,6.6,1,1,1,1,0
1003022,3,43,Female,Intervention,10.4,10.2,10.6,11.1,1,1,1,1,0
1003024,3,35,Male,Intervention,8.1999998,6.5999999,7.1999998,8,1,1,1,,0
1003042,3,52,Male,Intervention,7.6999998,6.6999998,5.8000002,6.4,0,0,0,0,9
1003060,3,59,Female,Intervention,6.0999999,,,8.1,1,,,,0
1004016,4,53,Male,Intervention,6.1999998,6.1999998,6,9.6,1,,1,1,
1004021,4,59,Female,Intervention,7.3000002,7,7.0999999,7.6,1,1,1,1,0
1004041,4,74,Female,Intervention,8.8000002,8.5,5.9000001,6.3,1,1,,,0
1004049,4,51,Male,Intervention,9.3000002,7.5999999,9.6000004,8.7,1,1,1,1,0
1004051,4,75,Female,Intervention,8.6000004,,6.9000001,7.9,1,,1,1,0
1004056,4,50,Female,Intervention,6.5999999,5.5999999,5.6999998,6.6,,,,,0
1004059,4,56,Female,Intervention,10,8.6000004,,,1,1,1,1,0
1004065,4,39,Male,Intervention,6.9000001,6.0999999,6.0999999,7.1,,,,,0
1004067,4,41,Female,Intervention,6.4000001,,5.9000001,,0,0,0,0,0
1004070,4,68,Male,Intervention,6.1999998,5.4000001,,6,1,,1,1,0
1004073,4,45,Male,Intervention,11.3,9.1000004,8.3999996,8.3,0,0,0,0,
1004075,4,68,Female,Intervention,6.4000001,5.5999999,,9.2,1,1,1,1,0
1004083,4,58,Female,Intervention,6.8000002,5.6999998,6.0999999,5.9,1,1,1,1,0
1005009,5,67,Male,Control,6.3000002,9.5,9.6000004,7.8,0,1,1,1,
1005020,5,73,Male,Control,6.9000001,6.4000001,6.5,7.2,1,1,1,1,0
1005028,5,72,Female,Control,9.8999996,8.1000004,8.5,6.7,1,1,1,1,0
1005031,5,61,Female,Control,7.4000001,7,7.1999998,7.3,1,1,1,1,0
1005047,5,48,Female,Control,11,6.3000002,6.1999998,6.6,1,1,1,1,0
1005048,5,44,Female,Control,11.5,,,12.1,0,0,,0,
1005084,5,67,Female,Control,6.8000002,5.9000001,5.5,6.2,1,1,1,1,0
1005086,5,70,Male,Control,6.1999998,5.8000002,6.3000002,7.2,1,1,1,1,0
1005096,5,64,Female,Control,7.3000002,7.0999999,6.6999998,7,1,1,1,1,0
1006018,6,42,Male,Intervention,12.4,7.1999998,8.5,10.8,1,1,1,,
1006038,6,52,Female,Intervention,6.8000002,7.3000002,7,7.9,1,1,1,1,0
1006053,6,41,Male,Intervention,10.4,7.9000001,7.3000002,9.3,,,,,
1006088,6,52,Male,Intervention,10.3,7.5999999,7.5999999,5.9,1,1,1,1,0
1007035,7,46,Male,Intervention,6.0999999,5.4000001,5.1999998,5.7,1,1,1,1,0
1008006,8,41,Female,Control,6.3000002,5.9000001,5.9000001,6.8,1,1,1,1,0
1008010,8,37,Male,Control,9.8000002,7.5,7.4000001,7.6,0,0,0,0,15
1009003,9,54,Male,Control,8.6000004,7.9000001,7.5999999,5.8,1,1,1,1,0
1010061,10,70,Female,Intervention,10.9,5.5999999,5.5,6.4,1,1,1,1,0
1010063,10,32,Male,Intervention,9.1999998,4.9000001,4.9000001,6.2,1,1,1,1,0
1010069,10,53,Female,Intervention,9.3999996,8.3999996,,8.2,1,1,1,,
1010076,10,49,Female,Intervention,12.3,,6.8000002,5.7,1,1,1,1,0
1011026,11,76,Male,Intervention,10.6,,6.5999999,6.7,1,1,1,1,0
1011043,11,58,Male,Intervention,7.3000002,6.5999999,6.5999999,7.4,1,1,1,1,0
1011046,11,77,Female,Intervention,8.1999998,7.6999998,7.6999998,6.5,1,1,1,1,0
1301019,1,65,Female,Intervention,,6.3000002,5.8000002,6.8,1,1,1,1,
1301065,1,62,Female,Intervention,5.8000002,6.1999998,6,7.9,1,1,1,,-99
1302005,2,62,Female,Intervention,9.8000002,9.5,6.9000001,7,1,1,1,1,0
1302025,2,44,Male,Intervention,8.1999998,6.4000001,5.8000002,6.2,0,0,0,0,15
1302047,2,38,Female,Intervention,7.0999999,4.9000001,4.6999998,6,1,,1,1,0
1302064,2,63,Male,Intervention,5.9000001,6,5.6999998,6.5,1,,1,,0
1303008,3,41,Male,Intervention,7.3000002,6.8000002,6.1999998,6,1,1,1,,0
1303013,3,67,Female,Intervention,6.4000001,6.0999999,6.0999999,6.7,1,1,1,1,0
1303015,3,76,Female,Intervention,8.3000002,5.8000002,5.1999998,6.3,1,1,1,1,0
1303030,3,67,Male,Intervention,6.5,5.8000002,5.6999998,6.5,1,1,1,1,0
1303034,3,55,Female,Intervention,5.9000001,6.9000001,6.1999998,8,1,1,,1,0
1303066,3,40,Female,Intervention,7.5999999,8.3000002,7.5,6.3,1,1,,,
1303068,3,52,Male,Intervention,5.5999999,6,5.5,6.3,0,0,0,0,20
1305002,5,71,Male,Intervention,10,10.1,,8.1,1,1,1,1,0
1305023,5,57,Female,Intervention,,,,7,1,,,,0
1305035,5,61,Male,Intervention,11.5,,,6.7,1,1,,1,0
1305039,5,41,Male,Intervention,9.6999998,6.3000002,,6.9,1,,1,,
1305042,5,54,Female,Intervention,6.0999999,,5.6999998,6.5,1,1,1,1,0
1306003,6,48,Male,Control,7.6999998,6.0999999,,6.9,1,1,1,1,
1306043,6,61,Male,Control,7.5,7.3000002,6.6999998,,1,1,,,-99
1306053,6,57,Female,Control,10.1,5.6999998,5.9000001,,0,0,0,0,-99
1308054,8,70,Female,Control,5.8000002,5.5999999,5.5999999,6.4,1,1,1,1,0
1309016,9,71,Female,Control,5.5999999,6.1999998,5.5999999,6.1,1,1,1,1,
1309018,9,80,Male,Control,6,5.4000001,5.6999998,,1,1,1,1,0
1309024,9,58,Male,Control,5.5,5.1999998,4.9000001,,1,1,1,1,0
1309026,9,77,Male,Control,6.4000001,6.1999998,5.5,6,1,1,1,1,0
1309028,9,75,Female,Control,5.9000001,5.3000002,5,6,1,1,1,1,0
1309037,9,72,Male,Control,7.5,6.5,7.3000002,7,1,1,,1,0
1309038,9,80,Male,Control,5.8000002,5,5.5,6.1,,,,,
1309056,9,74,Female,Control,6.1999998,6.0999999,6.5,,,,,,0
1310001,10,65,Female,Intervention,18.1,10.1,,6.6,1,1,1,1,0
1310045,10,70,Female,Intervention,6.5999999,5.8000002,6.1999998,7.4,0,0,0,0,10
1311027,11,71,Male,Intervention,6.4000001,5.8000002,5.5,7.1,1,1,,,
1401019,1,69,Female,Control,6.5,6.5999999,6.9000001,5.8,1,1,1,1,0
1403010,3,69,Male,Intervention,6.9000001,7,7.6999998,7.1,1,1,1,1,0
1403025,3,65,Male,Intervention,6.5,6.1999998,6.0999999,6,1,1,1,1,0